Darwin compilation

classic Classic list List threaded Threaded
4 messages Options
Reply | Threaded
Open this post in threaded view
|

Darwin compilation

Paul Davidson
Darwin fails make all. Checked out revision 1075.

genmath.inc(1115,28) Fatal: Internal error 200507161
genmath.inc(1115,28) Fatal: Compilation aborted
make[7]: *** [system.ppu] Error 1
make[6]: *** [darwin_all] Error 2
make[5]: *** [rtl] Error 2
make[4]: *** [next] Error 2
make[3]: *** [ppc2] Error 2
make[2]: *** [cycle] Error 2
make[1]: *** [compiler_cycle] Error 2
make: *** [build-stamp.powerpc-darwin] Error 2

P Davidson
Corax Networks Inc.
http://CoraxNetworks.com

IMPORTANT NOTICE:  This message is intended only for the use of the
individual or entity to which it is addressed. The message may contain
information that is privileged, confidential and exempt from disclosure
under applicable law.  If the reader of this message is not the
intended recipient, or the employee or agent responsible for delivering
the message to the intended recipient, you are notified that any
dissemination, distribution or copying of this communication is
strictly prohibited.  If you have received this communication in error,
please notify Corax Networks immediately by email at
[hidden email].  Thank you.

_______________________________________________
fpc-pascal maillist  -  [hidden email]
http://lists.freepascal.org/mailman/listinfo/fpc-pascal
Reply | Threaded
Open this post in threaded view
|

Re: Darwin compilation

Florian Klaempfl-2
Paul Davidson wrote:

> Darwin fails make all. Checked out revision 1075.
>
> genmath.inc(1115,28) Fatal: Internal error 200507161
> genmath.inc(1115,28) Fatal: Compilation aborted

Fixed.

> make[7]: *** [system.ppu] Error 1
> make[6]: *** [darwin_all] Error 2
> make[5]: *** [rtl] Error 2
> make[4]: *** [next] Error 2
> make[3]: *** [ppc2] Error 2
> make[2]: *** [cycle] Error 2
> make[1]: *** [compiler_cycle] Error 2
> make: *** [build-stamp.powerpc-darwin] Error 2
>
> P Davidson
> Corax Networks Inc.
> http://CoraxNetworks.com
>
> IMPORTANT NOTICE:  This message is intended only for the use of the
> individual or entity to which it is addressed. The message may contain
> information that is privileged, confidential and exempt from disclosure
> under applicable law.  If the reader of this message is not the intended
> recipient, or the employee or agent responsible for delivering the
> message to the intended recipient, you are notified that any
> dissemination, distribution or copying of this communication is strictly
> prohibited.  If you have received this communication in error, please
> notify Corax Networks immediately by email at
> [hidden email].  Thank you.
>
> _______________________________________________
> fpc-pascal maillist  -  [hidden email]
> http://lists.freepascal.org/mailman/listinfo/fpc-pascal

_______________________________________________
fpc-pascal maillist  -  [hidden email]
http://lists.freepascal.org/mailman/listinfo/fpc-pascal
Reply | Threaded
Open this post in threaded view
|

Re: Darwin compilation

Paul Davidson
This fix works, but now:

h2pas.pas:5708:Fixup of 34988 too large for field width of 16 bits
h2pas.pas:5683:Fixup of 35076 too large for field width of 16 bits
h2pas.pas:5664:Fixup of 35140 too large for field width of 16 bits
h2pas.pas:5622:Fixup of 35288 too large for field width of 16 bits
h2pas.pas:5542:Fixup of 35580 too large for field width of 16 bits
h2pas.pas:5540:Fixup of 35588 too large for field width of 16 bits
h2pas.pas:5537:Fixup of 35600 too large for field width of 16 bits
h2pas.pas(2879,15) Error: Error while assembling exitcode 1
h2pas.pas(2879,15) Fatal: There were 2 errors compiling module, stopping
h2pas.pas(2879,15) Fatal: Compilation aborted
make[3]: *** [h2pas] Error 1
make[2]: *** [h2pas_all] Error 2
make[1]: *** [utils_all] Error 2
make: *** [build-stamp.powerpc-darwin] Error 2

On Sep 13, 2005, at 16:55, Florian Klaempfl wrote:

> Paul Davidson wrote:
>
>> Darwin fails make all. Checked out revision 1075.
>>
>> genmath.inc(1115,28) Fatal: Internal error 200507161
>> genmath.inc(1115,28) Fatal: Compilation aborted
>
> Fixed.
>
>> make[7]: *** [system.ppu] Error 1
>> make[6]: *** [darwin_all] Error 2
>> make[5]: *** [rtl] Error 2
>> make[4]: *** [next] Error 2
>> make[3]: *** [ppc2] Error 2
>> make[2]: *** [cycle] Error 2
>> make[1]: *** [compiler_cycle] Error 2
>> make: *** [build-stamp.powerpc-darwin] Error 2
>>
>> _______________________________________________
>> fpc-pascal maillist  -  [hidden email]
>> http://lists.freepascal.org/mailman/listinfo/fpc-pascal
>
> _______________________________________________
> fpc-pascal maillist  -  [hidden email]
> http://lists.freepascal.org/mailman/listinfo/fpc-pascal
>
>
P Davidson
Corax Networks Inc.
http://CoraxNetworks.com

_______________________________________________
fpc-pascal maillist  -  [hidden email]
http://lists.freepascal.org/mailman/listinfo/fpc-pascal
Reply | Threaded
Open this post in threaded view
|

Re: Darwin compilation

Florian Klämpfl
Paul Davidson wrote:

> This fix works, but now:

That's Jonas' job :)

>
> h2pas.pas:5708:Fixup of 34988 too large for field width of 16 bits
> h2pas.pas:5683:Fixup of 35076 too large for field width of 16 bits
> h2pas.pas:5664:Fixup of 35140 too large for field width of 16 bits
> h2pas.pas:5622:Fixup of 35288 too large for field width of 16 bits
> h2pas.pas:5542:Fixup of 35580 too large for field width of 16 bits
> h2pas.pas:5540:Fixup of 35588 too large for field width of 16 bits
> h2pas.pas:5537:Fixup of 35600 too large for field width of 16 bits
> h2pas.pas(2879,15) Error: Error while assembling exitcode 1
> h2pas.pas(2879,15) Fatal: There were 2 errors compiling module, stopping
> h2pas.pas(2879,15) Fatal: Compilation aborted
> make[3]: *** [h2pas] Error 1
> make[2]: *** [h2pas_all] Error 2
> make[1]: *** [utils_all] Error 2
> make: *** [build-stamp.powerpc-darwin] Error 2
>
> On Sep 13, 2005, at 16:55, Florian Klaempfl wrote:
>
>> Paul Davidson wrote:
>>
>>> Darwin fails make all. Checked out revision 1075.
>>>
>>> genmath.inc(1115,28) Fatal: Internal error 200507161
>>> genmath.inc(1115,28) Fatal: Compilation aborted
>>
>>
>> Fixed.
>>
>>> make[7]: *** [system.ppu] Error 1
>>> make[6]: *** [darwin_all] Error 2
>>> make[5]: *** [rtl] Error 2
>>> make[4]: *** [next] Error 2
>>> make[3]: *** [ppc2] Error 2
>>> make[2]: *** [cycle] Error 2
>>> make[1]: *** [compiler_cycle] Error 2
>>> make: *** [build-stamp.powerpc-darwin] Error 2
>>>
>>> _______________________________________________
>>> fpc-pascal maillist  -  [hidden email]
>>> http://lists.freepascal.org/mailman/listinfo/fpc-pascal
>>
>>
>> _______________________________________________
>> fpc-pascal maillist  -  [hidden email]
>> http://lists.freepascal.org/mailman/listinfo/fpc-pascal
>>
>>
> P Davidson
> Corax Networks Inc.
> http://CoraxNetworks.com
>
> _______________________________________________
> fpc-pascal maillist  -  [hidden email]
> http://lists.freepascal.org/mailman/listinfo/fpc-pascal

_______________________________________________
fpc-pascal maillist  -  [hidden email]
http://lists.freepascal.org/mailman/listinfo/fpc-pascal